Microsoft MVP성태의 닷넷 이야기
글쓴 사람
정성태 (techsharer at outlook.com)
홈페이지
첨부 파일
 

error MSB4044: The "Fody.WeavingTask" task was not given a value for the required parameter "IntermediateDir".

예를 들어 etrace같은,

goldshtn / etrace
; https://github.com/goldshtn/etrace

몇몇 오픈 소스 프로젝트를 빌드하는 경우 기본 빌드 시스템에서는 다음과 같은 컴파일 오류가 발생할 수 있습니다.

1>------ Rebuild All started: Project: etrace, Configuration: Debug Any CPU ------
1>E:\git_clone\etrace\packages\Fody.1.28.3\build\Fody.targets(50,5): error MSB4044: The "Fody.WeavingTask" task was not given a value for the required parameter "IntermediateDir".
========== Rebuild All: 0 succeeded, 1 failed, 0 skipped ==========

이를 위해 Fody를 NuGet으로부터 설치할 수 있는데,

Fody 
; https://www.nuget.org/packages/Fody

Install-Package Fody

그래도 다음과 같은 오류가 발생합니다. ^^;

1>------ Rebuild All started: Project: etrace, Configuration: Debug Any CPU ------
1>E:\git_clone\etrace\packages\Fody.6.2.4\build\Fody.targets(38,12): error MSB4086: A numeric comparison was attempted on "$(MsBuildMajorVersion)" that evaluates to "" instead of a number, in condition "($(MsBuildMajorVersion) < 16)".
========== Rebuild All: 0 succeeded, 1 failed, 0 skipped ==========

문제가 되는 Fody.targets 파일의 38 라인을 보면,

<Error Condition="($(MsBuildMajorVersion) &lt; 16)"
        Text="Fody is only supported on MSBuild 16 and above. Current version: $(MsBuildMajorVersion)." />

MsBuildMajorVersion 변숫값을 확인하고 있는데 원래 이건 비주얼 스튜디오의 빌드 시스템에서 존재하지 않는 상수입니다. 이에 대해 검색해 보면,

Error On compile - MsBuildMajorVersion
; https://github.com/NYAN-x-CAT/AsyncRAT-C-Sharp/issues/61

그러니까... 결국 Fody 자체에서 정의하는 변수인 듯한데 현재 실행된 비주얼 스튜디오 내에서 NuGet으로 설치한 경우에는 바로 반영이 되지 않기 때문에 다시 비주얼 스튜디오를 시작하면 됩니다.




혹은 다음과 같은 빌드 오류가 발생한다면?

1>------ Rebuild All started: Project: etrace, Configuration: Debug Any CPU ------
1>MSBUILD : error : Fody: No weavers found for the configuration entries Costura. Add the desired weavers via their nuget package.
========== Rebuild All: 0 succeeded, 1 failed, 0 skipped ==========

메시지에 따라 Costura.Fody를 설치하시면 됩니다.

Install-Package Costura.Fody




[이 글에 대해서 여러분들과 의견을 공유하고 싶습니다. 틀리거나 미흡한 부분 또는 의문 사항이 있으시면 언제든 댓글 남겨주십시오.]



donaricano-btn



[최초 등록일: ]
[최종 수정일: 8/30/2020 ]

Creative Commons License
이 저작물은 크리에이티브 커먼즈 코리아 저작자표시-비영리-변경금지 2.0 대한민국 라이센스에 따라 이용하실 수 있습니다.
by SeongTae Jeong, mailto:techsharer at outlook.com

비밀번호

댓글 쓴 사람
 




1  2  3  4  5  6  7  8  9  [10]  11  12  13  14  15  ...
NoWriterDateCnt.TitleFile(s)
12376정성태10/15/2020914오류 유형: 669. windbg - sos의 name2ee 명령어 실행 시 "Failed to request module list." 오류
12375정성태10/15/20201302Windows: 177. 윈도우 탐색기에서 띄우는 cmd.exe 창의 디렉터리 구분 문자가 'Yen(&#0165;)' 기호로 나오는 경우 [1]
12374정성태11/22/20201501.NET Framework: 953. C# 9.0 - (6) 함수 포인터(Function pointers) [1]파일 다운로드2
12373정성태10/14/2020875.NET Framework: 952. OpCodes.Box와 관련해 IL 형식으로 직접 코딩 시 유의할 점
12372정성태11/22/20201266.NET Framework: 951. C# 9.0 - (5) 로컬 함수에 특성 지정 가능(Attributes on local functions)파일 다운로드1
12371정성태10/13/2020830개발 환경 구성: 519. Visual Studio의 Ctrl+Shift+U (Edit.MakeUppercase) 단축키가 동작하지 않는 경우
12370정성태10/13/20201014Linux: 33. Linux - nmcli를 이용한 고정 IP 설정
12369정성태10/21/20202182Windows: 176. Raymond Chen이 한글날에 밝히는 윈도우의 한글 자모 분리 현상 [1]
12368정성태10/12/20201074오류 유형: 668. VSIX 확장 빌드 - The "GetDeploymentPathFromVsixManifest" task failed unexpectedly.
12367정성태10/12/20201430오류 유형: 667. Ubuntu - Temporary failure resolving 'kr.archive.ubuntu.com'
12366정성태11/22/20201215.NET Framework: 950. C# 9.0 - (4) 원시 크기 정수(Native ints) [1]파일 다운로드1
12365정성태11/22/20201128.NET Framework: 949. C# 9.0 - (3) 람다 메서드의 매개 변수 무시(Lambda discard parameters)파일 다운로드1
12364정성태11/22/20201365.NET Framework: 948. C# 9.0 - (2) localsinit 플래그 내보내기 무시(Suppress emitting localsinit flag)파일 다운로드1
12363정성태11/22/20201717.NET Framework: 947. C# 9.0 - (1) 대상으로 형식화된 new 식(Target-typed new expressions) [2]파일 다운로드1
12362정성태10/11/2020903VS.NET IDE: 151. Visual Studio 2019에 .NET 5 rc/preview 적용하는 방법
12361정성태10/19/20201348.NET Framework: 946. C# 9.0을 위한 개발 환경 구성
12360정성태10/8/2020763오류 유형: 666. The type or namespace name '...' does not exist in the namespace 'Microsoft.VisualStudio.TestTools' (are you missing an assembly reference?)
12359정성태10/7/2020939오류 유형: 665. Windows - 재부팅 후 iSCSI 연결이 끊기는 문제
12358정성태10/7/2020831오류 유형: 664. Web Deploy 설치 시 "A newer version of Microsoft Web Deploy 3.6 was found on this machine." 오류
12357정성태10/7/2020697오류 유형: 663. 이벤트 로그 - The storage optimizer couldn't complete retrim on New Volume
12356정성태10/7/2020902오류 유형: 662. ASP.NET Core와 500.19, 500.21 오류 (0x8007000d)
12355정성태10/3/2020697오류 유형: 661. Hyper-V Linux VM의 Internal 유형의 가상 Switch에 대한 IP 연결이 되지 않는 경우
12354정성태10/2/2020757오류 유형: 660. Web Deploy (msdeploy.axd) 실행 시 오류 기록
12353정성태10/7/2020872개발 환경 구성: 518. 비주얼 스튜디오에서 IIS 웹 서버로 "Web Deploy"를 이용해 배포하는 방법
12352정성태10/2/2020883개발 환경 구성: 517. Hyper-V Internal 네트워크에 NAT을 이용한 인터넷 연결 제공
12351정성태10/2/20201100오류 유형: 659. Nox 실행이 안 되는 경우 - Unable to bind to the underlying transport for ...
1  2  3  4  5  6  7  8  9  [10]  11  12  13  14  15  ...