Microsoft MVP성태의 닷넷 이야기
글쓴 사람
정성태 (techsharer at outlook.com)
홈페이지
첨부 파일
 

electronize - User Profile 디렉터리에 공백 문자가 있는 경우 빌드가 실패하는 문제

예를 들어, 윈도우의 사용자 이름이 "Default User"라고 가정해보겠습니다. 이런 경우라면 %USERPROFILE%이나 %LOCALAPPDATA%, %APPDATA% 등의 경로에 공백이 포함됩니다.

C:\temp> echo %USERPROFILE%
C:\Users\Default User

C:\temp> echo %LOCALAPPDATA%
C:\Users\Default User\AppData\Local

C:\temp> echo %APPDATA%
C:\Users\Default User\AppData\Roaming

이 상태에서 electronize로 빌드 시,

electronize build /target win-x64 /PublishReadyToRun false

다음과 같은 식의 오류가 발생하는데,

Error: EEXIST: file already exists, mkdir 'C:\Users\Default'
TypeError: Cannot read property 'loaded' of undefined
    at exit (C:\Program Files\nodejs\node_modules\npm\lib\utils\error-handler.js:98:27)
    at errorHandler (C:\Program Files\nodejs\node_modules\npm\lib\utils\error-handler.js:216:3)
    at C:\Program Files\nodejs\node_modules\npm\bin\npm-cli.js:77:20
    at cb (C:\Program Files\nodejs\node_modules\npm\lib\npm.js:225:22)
    at C:\Program Files\nodejs\node_modules\npm\lib\npm.js:263:24
    at C:\Program Files\nodejs\node_modules\npm\lib\config\core.js:83:7
    at Array.forEach (<anonymous>)
    at C:\Program Files\nodejs\node_modules\npm\lib\config\core.js:82:13
    at f (C:\Program Files\nodejs\node_modules\npm\node_modules\once\once.js:25:25)
    at afterExtras (C:\Program Files\nodejs\node_modules\npm\lib\config\core.js:173:20)
C:\Program Files\nodejs\node_modules\npm\lib\utils\error-handler.js:98
  var doExit = npm.config.loaded ? npm.config.get('_exit') : true
                          ^
TypeError: Cannot read property 'loaded' of undefined
    at exit (C:\Program Files\nodejs\node_modules\npm\lib\utils\error-handler.js:98:27)
    at process.errorHandler (C:\Program Files\nodejs\node_modules\npm\lib\utils\error-handler.js:216:3)
    at process.emit (events.js:198:13)
    at process._fatalException (internal/bootstrap/node.js:496:27)
Install for electron-builder@latest failed with code 7
F:\cloud_drive\Dropbox\articles\elec_net\kestrel_razor_sample\ConsoleApp1\obj\desktop\win-x64>
... done

npm ERR! code ENOLOCAL
npm ERR! Could not install from "User\AppData\Roaming\npm-cache\_npx\16672" as it does not contain a package.json file.
npm ERR! A complete log of this run can be found in:
npm ERR!     C:\Users\Default User\AppData\Roaming\npm-cache\_logs\2021-01-27T05_21_25_321Z-debug.log
Install for electron-builder@latest failed with code 1

출력에 나온 log 파일을 보면 node.exe에 전달된 경로가 이렇게 해석된 것을 확인할 수 있습니다.

0 info it worked if it ends with ok
1 verbose cli [ 'C:\\Program Files\\nodejs\\node.exe',
1 verbose cli   'C:\\Program Files\\nodejs\\node_modules\\npm\\bin\\npm-cli.js',
1 verbose cli   'install',
1 verbose cli   'electron-builder@latest',
1 verbose cli   '--global',
1 verbose cli   '--prefix',
1 verbose cli   'C:\\Users\\Default',
1 verbose cli   'User\\AppData\\Roaming\\npm-cache\\_npx\\16672',
1 verbose cli   '--loglevel',
1 verbose cli   'error',
1 verbose cli   '--json' ]
...[생략]...

원인을 유추해 보면, 저 경로는 "%APPDATA%" 경로에 포함된 공백이 명령행 인자에서 2개로 나눠져 인식이 되었기 때문입니다.




이에 대한 근본적인 원인을 해결하려면 저렇게 실행하는 코드를 수정해야 합니다. 가령 node.exe를 실행할 때 전달하는 %APPDATA%에 대한 경로를 다음과 같은 식으로 인용부호로 묶어 전달해야 합니다.

c:\temp> node.exe "C:\Users\Default User\AppData\Roaming\npm-cache\_npx\16672" ...[생략]...

따라서 이러한 버그를 수정해 달라는 이슈를 생성하거나, 아니면 직접 소스 코드를 고쳐 빌드하는 수 밖에는 없습니다.




한 가지 다행이라면, 이렇게 경로에 '공백 문자'가 있는 경우 8.3 형식의 경로를 사용해 표현하는 것이 가능하다는 점입니다.

Windows - 도스 시절의 8.3 경로를 알아내는 방법
; https://www.sysnet.pe.kr/2/0/12511

가령, 이런 경우 electronize는 내부에서 "C:\Users\Default User\AppData\Roaming\npm-cache\_npx\21340"라는 경로를 아마도 다음과 같은 식으로 구했을 것입니다.

string path = GetEnvrionmentVairable("APPDATA"); // C:\Users\Default User\AppData\Roaming
string arg1 = path + "\npm-cache\_npx\16672";

따라서 환경 변수로 설정된 LOCALAPPDATA나, APPDATA에 대해 같은 경로로 대우받는 8.3 형식으로 명시하면 됩니다.

SET LOCALAPPDATA=C:\Users\DEFAULT~1\AppData\Local
SET APPDATA=C:\Users\DEFAULT~1\AppData\Roaming

이때 사용자 계정으로 등록된 "Default User"의 8.3 이름은 다음과 같은 명령어로 간단하게 구할 수 있습니다.

C:\temp> dir /X "%USERPROFILE%\.."
 Volume in drive C has no label.
 Volume Serial Number is C02C-196F

 Directory of C:\Users

2021-01-27  오후 02:33    <DIR>                       .
2021-01-27  오후 02:33    <DIR>                       ..
2020-12-24  오후 08:17    <DIR>          DEFAUL~1     Default User
2021-01-22  오후 07:42    <DIR>          MSSQLS~1     MSSQLSERVER
2020-12-03  오전 11:02    <DIR>          RDVGRA~1     RDV GRAPHICS SERVICE
2021-01-22  오후 07:42    <DIR>          SQLTEL~1     SQLTELEMETRY
               0 File(s)              0 bytes
               6 Dir(s)  50,487,128,064 bytes free

명령행에서 이렇게 설정하고 다시 문제가 되었던 빌드 명령을 수행하면,

c:\temp> SET LOCALAPPDATA=C:\Users\DEFAULT~1\AppData\Local
c:\temp> SET APPDATA=C:\Users\DEFAULT~1\AppData\Roaming

c:\temp> electronize build /target win-x64 /PublishReadyToRun false

정상적으로 실행이 되는 것을 확인할 수 있습니다.




[이 글에 대해서 여러분들과 의견을 공유하고 싶습니다. 틀리거나 미흡한 부분 또는 의문 사항이 있으시면 언제든 댓글 남겨주십시오.]



donaricano-btn



[최초 등록일: ]
[최종 수정일: 1/28/2021

Creative Commons License
이 저작물은 크리에이티브 커먼즈 코리아 저작자표시-비영리-변경금지 2.0 대한민국 라이센스에 따라 이용하실 수 있습니다.
by SeongTae Jeong, mailto:techsharer at outlook.com

비밀번호

댓글 쓴 사람
 




1  2  3  4  5  6  [7]  8  9  10  11  12  13  14  15  ...
NoWriterDateCnt.TitleFile(s)
12603정성태4/16/2021394VS.NET IDE: 162. 비주얼 스튜디오 - 상속받은 컨트롤이 디자인 창에서 지원되지 않는 문제
12602정성태4/16/2021530VS.NET IDE: 161. x64 DLL 프로젝트의 컨트롤이 Visual Studio의 Designer에서 보이지 않는 문제
12601정성태4/15/2021391.NET Framework: 1040. C# - REST API 대신 github 클라이언트 라이브러리를 통해 프로그래밍으로 접근
12600정성태4/15/2021329.NET Framework: 1039. C# - Kubeconfig의 token 설정 및 인증서 구성을 자동화하는 프로그램
12599정성태4/14/2021335.NET Framework: 1038. C# - 인증서 및 키 파일로부터 pfx/p12 파일을 생성하는 방법파일 다운로드1
12598정성태4/14/2021361.NET Framework: 1037. openssl의 PEM 개인키 파일을 .NET RSACryptoServiceProvider에서 사용하는 방법 (2)파일 다운로드1
12597정성태4/13/2021334개발 환경 구성: 569. csproj의 내용을 공통 설정할 수 있는 Directory.Build.targets / Directory.Build.props 파일
12596정성태4/12/2021439개발 환경 구성: 568. Windows의 80 포트 점유를 해제하는 방법
12595정성태4/12/2021361.NET Framework: 1036. SQL 서버 - varbinary 타입에 대한 문자열의 CAST, CONVERT 변환을 C# 코드로 구현
12594정성태4/11/2021460.NET Framework: 1035. C# - kubectl 명령어 또는 REST API 대신 Kubernetes 클라이언트 라이브러리를 통해 프로그래밍으로 접근 [1]파일 다운로드1
12593정성태4/10/2021434개발 환경 구성: 567. Docker Desktop for Windows - kubectl proxy 없이 k8s 대시보드 접근 방법
12592정성태4/10/2021397개발 환경 구성: 566. Docker Desktop for Windows - k8s dashboard의 Kubeconfig 로그인 및 Skip 방법
12591정성태4/9/2021636.NET Framework: 1034. C# - byte 배열을 Hex(16진수) 문자열로 고속 변환하는 방법파일 다운로드1
12590정성태4/9/2021384.NET Framework: 1033. C# - .NET 4.0 이하에서 Console.IsInputRedirected 구현
12589정성태4/8/2021464.NET Framework: 1032. C# - Environment.OSVersion의 문제점 및 윈도우 운영체제의 버전을 구하는 다양한 방법
12588정성태4/7/2021404개발 환경 구성: 565. PowerShell - New-SelfSignedCertificate를 사용해 CA 인증서 생성 및 인증서 서명 방법
12587정성태4/6/2021543개발 환경 구성: 564. Windows 10 - ClickOnce 배포처럼 사용할 수 있는 MSIX 설치 파일
12586정성태4/5/2021345오류 유형: 710. Windows - Restart-Computer / shutdown 명령어 수행 시 Access is denied(E_ACCESSDENIED)
12585정성태4/5/2021366개발 환경 구성: 563. 기본 생성된 kubeconfig 파일의 내용을 새롭게 생성한 인증서로 구성하는 방법
12584정성태4/1/2021436개발 환경 구성: 562. kubeconfig 파일 없이 kubectl 옵션만으로 실행하는 방법
12583정성태3/29/2021485개발 환경 구성: 561. kubectl 수행 시 다른 k8s 클러스터로 접속하는 방법
12582정성태3/29/2021486오류 유형: 709. Visual C++ - 컴파일 에러 error C2059: syntax error: '__stdcall'
12581정성태3/28/2021576.NET Framework: 1031. WinForm/WPF에서 Console 창을 띄워 출력하는 방법 (2) - Output 디버깅 출력을 AllocConsole로 우회 [2]
12580정성태3/28/2021505오류 유형: 708. SQL Server Management Studio - Execution Timeout Expired.
12579정성태3/28/2021433오류 유형: 707. 중첩 가상화(Nested Virtualization) - The virtual machine could not be started because this platform does not support nested virtualization.
12578정성태3/27/2021436개발 환경 구성: 560. Docker Desktop for Windows 기반의 Kubernetes 구성 (2) - WSL 2 인스턴스에 kind가 구성한 k8s 서비스 위치
1  2  3  4  5  6  [7]  8  9  10  11  12  13  14  15  ...