Microsoft MVP성태의 닷넷 이야기
글쓴 사람
정성태 (techsharer at outlook.com)
홈페이지
첨부 파일
 

Visual Studio - Build Events에 robocopy를 사용할때 "Invalid Parameter #1" 오류가 발행하는 경우

이상하군요, 단순하게 다음과 같이 빌드 이벤트를 만들었는데,

$(ProjectDir)postBuildScript.bat "$(TargetDir)" $(TargetName)

REM postBuildScript.bat
robocopy %1 d:\temp %2.*

exit 0

빌드 시 오류가 발생합니다.

Error Invalid Parameter #1 : "E:\ConsoleApp1\bin\Debug" d:\temp ConsoleApp1.*"

원인은 지난 글에 쓴 것과 같은 이유인데,

robocopy - ERROR : No Destination Directory Specified.
; https://www.sysnet.pe.kr/2/0/12441

TargetDir이 넘겨주는 값이 "E:\ConsoleApp1\bin\Debug\"와 같이 마지막에 '\' 글자를 포함하고 있기 때문입니다. 하지만 오류 메시지의 출력 결과가 이번에는 다릅니다.

Rebuild started...
1>------ Rebuild All started: Project: ConsoleApp1, Configuration: Debug Any CPU ------
1>  ConsoleApp1 -> E:\ConsoleApp1\bin\Debug\ConsoleApp1.dll
1>  AnyCPU "E:\ConsoleApp1\bin\Debug\" ConsoleApp1
1>  
1>  -------------------------------------------------------------------------------
1>     ROBOCOPY     ::     Robust File Copy for Windows                              
1>  -------------------------------------------------------------------------------
1>  
1>    Started : 03 12월 2020 오전 10:24:53
1>     Source - 
1>       Dest - 
1>  
1>      Files : 
1>    Options : /DCOPY:DA /COPY:DAT /R:1000000 /W:30 
1>  
1>  ------------------------------------------------------------------------------
1>  
1>EXEC : error : Invalid Parameter #1 : "E:\ConsoleApp1\bin\Debug" d:\temp ConsoleApp1.*""
1>  
1>         Simple Usage :: ROBOCOPY source destination /MIR
1>  
1>               source :: Source Directory (drive:\path or \\server\share\path).
1>          destination :: Destination Dir  (drive:\path or \\server\share\path).
1>                 /MIR :: Mirror a complete directory tree.
1>  
1>      For more usage information run ROBOCOPY /?
1>  
1>                                                            
1>  ****  /MIR can DELETE files as well as copy them !
1>C:\Program Files (x86)\Microsoft Visual Studio\2019\Enterprise\MSBuild\Current\Bin\Microsoft.Common.CurrentVersion.targets(5461,5): error MSB3073: The command "E:\ConsoleApp1\postBuildScript.bat  AnyCPU "E:\ConsoleApp1\bin\Debug\" ConsoleApp1
1>C:\Program Files (x86)\Microsoft Visual Studio\2019\Enterprise\MSBuild\Current\Bin\Microsoft.Common.CurrentVersion.targets(5461,5): error MSB3073: " exited with code -1.
========== Rebuild All: 0 succeeded, 1 failed, 0 skipped ==========

어쨌든, 이 원인을 고치려면 지난 글에 소개한 3가지 방법 중 하나를 써야 하는데,

$(ProjectDir)postBuildScript.bat "$(TargetDir)" $(TargetName)

TargetDir 경로에 공백이 포함되어 있다면 다음과 같이 마지막에 '\' 문자를 하나 더 추가한 후 겹따옴표로 감쌀 수 있습니다.

$(ProjectDir)postBuildScript.bat $(PlatformName) "$(TargetDir)\" $(TargetName)




[이 글에 대해서 여러분들과 의견을 공유하고 싶습니다. 틀리거나 미흡한 부분 또는 의문 사항이 있으시면 언제든 댓글 남겨주십시오.]



donaricano-btn



[최초 등록일: ]
[최종 수정일: 12/4/2020]

Creative Commons License
이 저작물은 크리에이티브 커먼즈 코리아 저작자표시-비영리-변경금지 2.0 대한민국 라이센스에 따라 이용하실 수 있습니다.
by SeongTae Jeong, mailto:techsharer at outlook.com

비밀번호

댓글 쓴 사람
 




1  2  3  4  [5]  6  7  8  9  10  11  12  13  14  15  ...
NoWriterDateCnt.TitleFile(s)
12750정성태8/3/2021201디버깅 기술: 181. windbg - 콜 스택의 "Call Site" 오프셋 값이 가리키는 위치
12749정성태8/2/2021244개발 환경 구성: 590. Visual Studio 2017부터 단위 테스트에 DataRow 특성 지원
12748정성태8/2/2021164개발 환경 구성: 589. Azure Active Directory - tenant의 관리자(admin) 계정 로그인 방법
12747정성태8/1/2021185오류 유형: 748. 오류 기록 - MICROSOFT GRAPH – HOW TO IMPLEMENT IAUTHENTICATIONPROVIDER파일 다운로드1
12746정성태7/31/2021343개발 환경 구성: 588. 네트워크 장비 환경을 시뮬레이션하는 Packet Tracer 프로그램 소개
12745정성태7/31/2021166개발 환경 구성: 587. Azure Active Directory - tenant의 관리자 계정 로그인 방법
12744정성태7/30/2021167개발 환경 구성: 586. Azure Active Directory에 연결된 App 목록을 확인하는 방법?
12743정성태7/30/2021217.NET Framework: 1083. Azure Active Directory - 외부 Token Cache 저장소를 사용하는 방법파일 다운로드1
12742정성태7/30/2021231개발 환경 구성: 585. Azure AD 인증을 위한 사용자 인증 유형
12741정성태7/29/2021217.NET Framework: 1082. Azure Active Directory - Microsoft Graph API 호출 방법파일 다운로드1
12740정성태7/29/2021245오류 유형: 747. SharePoint - InvalidOperationException 0x80131509
12739정성태7/28/2021250오류 유형: 746. Azure Active Directory - IDW10106: The 'ClientId' option must be provided.
12738정성태7/28/2021360오류 유형: 745. Azure Active Directory - Client credential flows must have a scope value with /.default suffixed to the resource identifier (application ID URI).
12737정성태7/28/2021248오류 유형: 744. Azure Active Directory - The resource principal named api://...[client_id]... was not found in the tenant
12736정성태7/28/2021218오류 유형: 743. Active Azure Directory에서 "API permissions"의 권한 설정이 "Not granted for ..."로 나오는 문제
12735정성태7/27/2021287.NET Framework: 1081. C# - Azure AD 인증을 지원하는 데스크톱 애플리케이션 예제(Windows Forms)파일 다운로드1
12734정성태7/26/2021482스크립트: 20. 특정 단어로 시작하거나/끝나는 문자열을 포함/제외하는 정규 표현식 - Look-around
12733정성태7/23/2021251.NET Framework: 1081. Self-Contained/SingleFile 유형의 .NET Core/5+ 실행 파일을 임베딩한다면?파일 다운로드2
12732정성태7/23/2021175오류 유형: 742. SharePoint - The super user account utilized by the cache is not configured.
12731정성태7/23/2021190개발 환경 구성: 584. Add Internal URLs 화면에서 "Save" 버튼이 비활성화 된 경우
12730정성태7/23/2021287개발 환경 구성: 583. Visual Studio Code - Go 코드에서 입력을 받는 경우
12729정성태7/22/2021239.NET Framework: 1080. xUnit 단위 테스트에 메서드/클래스 수준의 문맥 제공 - Fixture
12728정성태7/22/2021205.NET Framework: 1079. MSTestv2 단위 테스트에 메서드/클래스/어셈블리 수준의 문맥 제공
12727정성태7/21/2021323.NET Framework: 1078. C# 단위 테스트 - MSTestv2/NUnit의 Assert.Inconclusive 사용법(?)
12726정성태7/21/2021302VS.NET IDE: 169. 비주얼 스튜디오 - 단위 테스트 선택 시 MSTestv2 외의 xUnit, NUnit 사용법
12725정성태7/21/2021347오류 유형: 741. Failed to find the "go" binary in either GOROOT() or PATH
1  2  3  4  [5]  6  7  8  9  10  11  12  13  14  15  ...