Microsoft MVP성태의 닷넷 이야기
글쓴 사람
정성태 (techsharer at outlook.com)
홈페이지
첨부 파일
 

error CS5001: Program does not contain a static 'Main' method suitable for an entry point

지난 글의 예제를,

C# 9 최상위 문에 STAThread 사용
; https://www.sysnet.pe.kr/2/0/12623

.NET Framework 4.0 대상의 C# 9.0 컴파일러로 실습하면 이런 오류가 발생합니다.

Rebuild started...
1>------ Rebuild All started: Project: ConsoleApp1, Configuration: Debug Any CPU ------
1>C:\temp\ConsoleApp1\Program.cs(1,1,33,2): warning CS0028: '<top-level-statements-entry-point>' has the wrong signature to be an entry point
1>C:\temp\ConsoleApp1\Program.cs(6,1,13,4): error CS1061: 'Task' does not contain a definition for 'GetAwaiter' and no accessible extension method 'GetAwaiter' accepting a first argument of type 'Task' could be found (are you missing a using directive or an assembly reference?)
1>CSC : error CS5001: Program does not contain a static 'Main' method suitable for an entry point
1>C:\temp\ConsoleApp1\Program.cs(6,1,13,3): error CS1061: 'Task<int>' does not contain a definition for 'GetAwaiter' and no accessible extension method 'GetAwaiter' accepting a first argument of type 'Task<int>' could be found (are you missing a using directive or an assembly reference?)
========== Rebuild All: 0 succeeded, 1 failed, 0 skipped ==========

오류 메시지가 "warning CS0028: '<top-level-statements-entry-point>' has the wrong signature to be an entry point"로 시작해 "error CS5001: Program does not contain a static 'Main' method suitable for an entry point"를 포함하고 있지만 실제 오류는 "error CS1061"에서 보여주는 메시지 때문에 발생하는 것입니다.

즉, C# 9.0의 TLS(최상위 문)로 번역된 <Main>$ 메서드로의 변환이 허용되려면 GetAwaiter 메서드가 필요한데,

Task.GetAwaiter Method
; https://docs.microsoft.com/en-us/dotnet/api/system.threading.tasks.task.getawaiter

그 메서드는 .NET 4.5부터 구현되어 있기 때문입니다. (참고로, "error CS5001: Program does not contain a static 'Main' method suitable for an entry point" 오류 메시지는 ".NET Core 콘솔 프로젝트에서 Kestrel 호스팅 방법" 글에서도 발생한 적이 있습니다.)




[이 글에 대해서 여러분들과 의견을 공유하고 싶습니다. 틀리거나 미흡한 부분 또는 의문 사항이 있으시면 언제든 댓글 남겨주십시오.]



donaricano-btn



[최초 등록일: ]
[최종 수정일: 5/3/2021

Creative Commons License
이 저작물은 크리에이티브 커먼즈 코리아 저작자표시-비영리-변경금지 2.0 대한민국 라이센스에 따라 이용하실 수 있습니다.
by SeongTae Jeong, mailto:techsharer at outlook.com

비밀번호

댓글 쓴 사람
 




1  2  3  4  [5]  6  7  8  9  10  11  12  13  14  15  ...
NoWriterDateCnt.TitleFile(s)
12740정성태7/29/2021194오류 유형: 747. SharePoint - InvalidOperationException 0x80131509
12739정성태7/28/2021185오류 유형: 746. Azure Active Directory - IDW10106: The 'ClientId' option must be provided.
12738정성태7/28/2021251오류 유형: 745. Azure Active Directory - Client credential flows must have a scope value with /.default suffixed to the resource identifier (application ID URI).
12737정성태7/28/2021190오류 유형: 744. Azure Active Directory - The resource principal named api://...[client_id]... was not found in the tenant
12736정성태7/28/2021156오류 유형: 743. Active Azure Directory에서 "API permissions"의 권한 설정이 "Not granted for ..."로 나오는 문제
12735정성태7/27/2021244.NET Framework: 1081. C# - Azure AD 인증을 지원하는 데스크톱 애플리케이션 예제(Windows Forms)파일 다운로드1
12734정성태7/26/2021330스크립트: 20. 특정 단어로 시작하거나/끝나는 문자열을 포함/제외하는 정규 표현식 - Look-around
12733정성태7/23/2021196.NET Framework: 1081. Self-Contained/SingleFile 유형의 .NET Core/5+ 실행 파일을 임베딩한다면?파일 다운로드2
12732정성태7/23/2021132오류 유형: 742. SharePoint - The super user account utilized by the cache is not configured.
12731정성태7/23/2021144개발 환경 구성: 584. Add Internal URLs 화면에서 "Save" 버튼이 비활성화 된 경우
12730정성태7/23/2021242개발 환경 구성: 583. Visual Studio Code - Go 코드에서 입력을 받는 경우
12729정성태7/22/2021188.NET Framework: 1080. xUnit 단위 테스트에 메서드/클래스 수준의 문맥 제공 - Fixture
12728정성태7/22/2021161.NET Framework: 1079. MSTestv2 단위 테스트에 메서드/클래스/어셈블리 수준의 문맥 제공
12727정성태7/21/2021273.NET Framework: 1078. C# 단위 테스트 - MSTestv2/NUnit의 Assert.Inconclusive 사용법(?)
12726정성태7/21/2021260VS.NET IDE: 169. 비주얼 스튜디오 - 단위 테스트 선택 시 MSTestv2 외의 xUnit, NUnit 사용법
12725정성태7/21/2021288오류 유형: 741. Failed to find the "go" binary in either GOROOT() or PATH
12724정성태7/21/2021411개발 환경 구성: 582. 윈도우 환경에서 Visual Studio Code + Go (Zip) 개발 환경 [1]
12723정성태7/21/2021196오류 유형: 740. SharePoint - Alternate access mappings have not been configured 경고
12722정성태7/20/2021208오류 유형: 739. MSVCR110.dll이 없어 exe 실행이 안 되는 경우
12721정성태7/20/2021148오류 유형: 738. The trust relationship between this workstation and the primary domain failed. - 세 번째 이야기
12720정성태7/19/2021198Linux: 43. .NET Core/5+ 응용 프로그램의 Ubuntu (Debian) 패키지 준비
12719정성태7/19/2021132오류 유형: 737. SharePoint 설치 시 "0x800710D8 The object identifier does not represent a valid object." 오류 발생
12718정성태7/19/2021192개발 환경 구성: 581. Windows에서 WSL로 파일 복사 시 root 소유권으로 적용되는 문제파일 다운로드1
12717정성태7/18/2021194Windows: 195. robocopy에서 파일의 ADS(Alternate Data Stream) 정보 복사를 제외하는 방법
12716정성태7/17/2021223개발 환경 구성: 580. msbuild의 Exec Task에 robocopy를 사용하는 방법파일 다운로드1
12715정성태7/17/2021906오류 유형: 736. Windows - MySQL zip 파일 버전의 "mysqld --skip-grant-tables" 실행 시 비정상 종료
1  2  3  4  [5]  6  7  8  9  10  11  12  13  14  15  ...