Microsoft MVP성태의 닷넷 이야기
글쓴 사람
정성태 (techsharer at outlook.com)
홈페이지
첨부 파일
 

.NET Core 2.2 빌드 - error MSB4018: The "RazorTagHelper" task failed unexpectedly.

이상하군요, .NET Core 2.0/2.1 프로젝트는 괜찮은데 유독 2.2 프로젝트에서만 빌드 오류가 발생합니다.

Rebuild started...
1>------ Rebuild All started: Project: CoreCoreWin2, Configuration: Debug Any CPU ------
1>C:\Program Files\dotnet\sdk\5.0.100\Sdks\Microsoft.NET.Sdk\targets\Microsoft.NET.EolTargetFrameworks.targets(28,5): warning NETSDK1138: The target framework 'netcoreapp2.2' is out of support and will not receive security updates in the future. Please refer to https://aka.ms/dotnet-core-support for more information about the support policy.
1>D:\workshop2\JenniferV\gitlab\UnitTest\AzureWebApps\AzureWebTest\CoreCoreWin2\Pages\Index.cshtml.cs(142,36,142,49): warning CS1998: This async method lacks 'await' operators and will run synchronously. Consider using the 'await' operator to await non-blocking API calls, or 'await Task.Run(...)' to do CPU-bound work on a background thread.
1>F:\nuget_root\microsoft.aspnetcore.razor.design\2.2.0\build\netstandard2.0\Microsoft.AspNetCore.Razor.Design.CodeGeneration.targets(79,5): error MSB4018: The "RazorTagHelper" task failed unexpectedly.
1>F:\nuget_root\microsoft.aspnetcore.razor.design\2.2.0\build\netstandard2.0\Microsoft.AspNetCore.Razor.Design.CodeGeneration.targets(79,5): error MSB4018: System.InvalidOperationException: DOTNET_HOST_PATH is not set
1>F:\nuget_root\microsoft.aspnetcore.razor.design\2.2.0\build\netstandard2.0\Microsoft.AspNetCore.Razor.Design.CodeGeneration.targets(79,5): error MSB4018:    at Microsoft.AspNetCore.Razor.Tasks.DotNetToolTask.get_DotNetPath()
1>F:\nuget_root\microsoft.aspnetcore.razor.design\2.2.0\build\netstandard2.0\Microsoft.AspNetCore.Razor.Design.CodeGeneration.targets(79,5): error MSB4018:    at Microsoft.AspNetCore.Razor.Tasks.DotNetToolTask.GenerateFullPathToTool()
1>F:\nuget_root\microsoft.aspnetcore.razor.design\2.2.0\build\netstandard2.0\Microsoft.AspNetCore.Razor.Design.CodeGeneration.targets(79,5): error MSB4018:    at Microsoft.Build.Utilities.ToolTask.ComputePathToTool()
1>F:\nuget_root\microsoft.aspnetcore.razor.design\2.2.0\build\netstandard2.0\Microsoft.AspNetCore.Razor.Design.CodeGeneration.targets(79,5): error MSB4018:    at Microsoft.Build.Utilities.ToolTask.Execute()
1>F:\nuget_root\microsoft.aspnetcore.razor.design\2.2.0\build\netstandard2.0\Microsoft.AspNetCore.Razor.Design.CodeGeneration.targets(79,5): error MSB4018:    at Microsoft.AspNetCore.Razor.Tasks.DotNetToolTask.Execute()
1>F:\nuget_root\microsoft.aspnetcore.razor.design\2.2.0\build\netstandard2.0\Microsoft.AspNetCore.Razor.Design.CodeGeneration.targets(79,5): error MSB4018:    at Microsoft.Build.BackEnd.TaskExecutionHost.Microsoft.Build.BackEnd.ITaskExecutionHost.Execute()
1>F:\nuget_root\microsoft.aspnetcore.razor.design\2.2.0\build\netstandard2.0\Microsoft.AspNetCore.Razor.Design.CodeGeneration.targets(79,5): error MSB4018:    at Microsoft.Build.BackEnd.TaskBuilder.<ExecuteInstantiatedTask>d__26.MoveNext()
1>Done building project "CoreCoreWin2.csproj" -- FAILED.
========== Rebuild All: 0 succeeded, 1 failed, 0 skipped ==========

DOTNET_HOST_PATH가 설정되어 있지 않다고 하는데, 실제로 검색해 보면,

Build is failing for Microsoft.NET.Sdk.Razor project
; https://developercommunity2.visualstudio.com/t/Build-is-failing-for-MicrosoftNETSdkR/1251808?preview=true

해결책으로 환경 변수 설정이 필요하다고 합니다.

환경 변수 이름: DOTNET_HOST_PATH
환경 변숫값: dotnet

path라는 이름에서 dotnet.exe가 있는 경로를 지정해야 할 것 같지만,

%ProgramFiles%\dotnet\dotnet.exe

환경 변수 PATH에 경로가 잡혀 있는 경우 dotnet만 있어도 잘 동작합니다.




[이 글에 대해서 여러분들과 의견을 공유하고 싶습니다. 틀리거나 미흡한 부분 또는 의문 사항이 있으시면 언제든 댓글 남겨주십시오.]



donaricano-btn



[최초 등록일: ]
[최종 수정일: 12/1/2020

Creative Commons License
이 저작물은 크리에이티브 커먼즈 코리아 저작자표시-비영리-변경금지 2.0 대한민국 라이센스에 따라 이용하실 수 있습니다.
by SeongTae Jeong, mailto:techsharer at outlook.com

비밀번호

댓글 쓴 사람
 




1  2  3  [4]  5  6  7  8  9  10  11  12  13  14  15  ...
NoWriterDateCnt.TitleFile(s)
12659정성태6/2/2021191Linux: 40. 우분투 설치 후 MBR 디스크 드라이브 여유 공간이 인식되지 않은 경우 - Logical Volume Management
12658정성태6/2/2021317Windows: 194. Microsoft Store에 있는 구글의 공식 Youtube App
12657정성태6/2/2021424Windows: 193. 윈도우 패키지 관리자 - winget 설치
12656정성태6/1/2021179.NET Framework: 1061. 서버 유형의 COM+에 적용할 수 없는 Server GC
12655정성태6/1/2021206오류 유형: 722. windbg/sos - savemodule - Fail to read memory
12654정성태5/31/2021186오류 유형: 721. Hyper-V - Saved 상태의 VM을 시작 시 오류 발생
12653정성태5/31/2021354.NET Framework: 1060. 닷넷 GC에 새롭게 구현되는 DPAD(Dynamic Promotion And Demotion for GC)
12652정성태5/31/2021177VS.NET IDE: 164. Visual Studio - Web Deploy로 Publish 시 암호창이 매번 뜨는 문제
12651정성태5/31/2021248오류 유형: 720. PostgreSQL - ERROR: 22P02: malformed array literal: "..."
12650정성태5/17/2021208기타: 82. OpenTabletDriver의 버튼에 더블 클릭을 매핑 및 게임에서의 지원 방법
12649정성태5/16/2021343.NET Framework: 1059. 세대 별 GC(Garbage Collection) 방식에서 Card table의 사용 의미
12648정성태5/16/2021269[예약]파일 다운로드1
12647정성태5/15/2021314.NET Framework: 1058. C# - C++과의 연동을 위한 구조체의 fixed 배열 필드 사용파일 다운로드1
12646정성태5/15/2021319[예약]파일 다운로드1
12645정성태5/14/2021346[예약]파일 다운로드1
12644정성태5/14/2021270오류 유형: 719. 윈도우 - 제어판의 "프로그램 및 기능" / "Windows 기능 켜기/끄기" 오류 0x800736B3
12643정성태5/14/2021235오류 유형: 718. 서버 유형의 COM+ 사용 시 0x80080005(Server execution failed) 오류 발생
12642정성태5/14/2021256오류 유형: 717. The 'Microsoft.ACE.OLEDB.12.0' provider is not registered on the local machine.
12641정성태5/13/2021288디버깅 기술: 179. 윈도우용 .NET Core 3 이상에서 Windbg의 sos 사용법
12640정성태5/13/2021322오류 유형: 716. RDP 연결 - Because of a protocol error (code: 0x112f), the remote session will be disconnected.
12639정성태5/12/2021239오류 유형: 715. Arduino: Open Serial Monitor - The module '...\detection.node' was compiled against a different Node.js version using NODE_MODULE_VERSION
12638정성태5/12/2021297사물인터넷: 63. NodeMCU v1 ESP8266 - 펌웨어 내 파일 시스템(SPIFFS, LittleFS) 및 EEPROM 활용
12637정성태5/10/2021319사물인터넷: 62. NodeMCU v1 ESP8266 보드의 A0 핀에 다중 아날로그 센서 연결 [1]
12636정성태5/10/2021330사물인터넷: 61. NodeMCU v1 ESP8266 보드의 A0 핀 사용법 - FSR-402 아날로그 압력 센서 연동파일 다운로드1
12635정성태5/9/2021279기타: 81. OpenTabletDriver를 (관리자 권한으로 실행하지 않고도) 관리자 권한의 프로그램에서 동작하게 만드는 방법
12634정성태5/9/2021303개발 환경 구성: 572. .NET에서의 신뢰도 등급 조정 - 외부 Manifest 파일을 두는 방법파일 다운로드1
1  2  3  [4]  5  6  7  8  9  10  11  12  13  14  15  ...