Microsoft MVP성태의 닷넷 이야기
글쓴 사람
정성태 (techsharer at outlook.com)
홈페이지
첨부 파일
 

electronize - User Profile 디렉터리에 공백 문자가 있는 경우 빌드가 실패하는 문제

예를 들어, 윈도우의 사용자 이름이 "Default User"라고 가정해보겠습니다. 이런 경우라면 %USERPROFILE%이나 %LOCALAPPDATA%, %APPDATA% 등의 경로에 공백이 포함됩니다.

C:\temp> echo %USERPROFILE%
C:\Users\Default User

C:\temp> echo %LOCALAPPDATA%
C:\Users\Default User\AppData\Local

C:\temp> echo %APPDATA%
C:\Users\Default User\AppData\Roaming

이 상태에서 electronize로 빌드 시,

electronize build /target win-x64 /PublishReadyToRun false

다음과 같은 식의 오류가 발생하는데,

Error: EEXIST: file already exists, mkdir 'C:\Users\Default'
TypeError: Cannot read property 'loaded' of undefined
    at exit (C:\Program Files\nodejs\node_modules\npm\lib\utils\error-handler.js:98:27)
    at errorHandler (C:\Program Files\nodejs\node_modules\npm\lib\utils\error-handler.js:216:3)
    at C:\Program Files\nodejs\node_modules\npm\bin\npm-cli.js:77:20
    at cb (C:\Program Files\nodejs\node_modules\npm\lib\npm.js:225:22)
    at C:\Program Files\nodejs\node_modules\npm\lib\npm.js:263:24
    at C:\Program Files\nodejs\node_modules\npm\lib\config\core.js:83:7
    at Array.forEach (<anonymous>)
    at C:\Program Files\nodejs\node_modules\npm\lib\config\core.js:82:13
    at f (C:\Program Files\nodejs\node_modules\npm\node_modules\once\once.js:25:25)
    at afterExtras (C:\Program Files\nodejs\node_modules\npm\lib\config\core.js:173:20)
C:\Program Files\nodejs\node_modules\npm\lib\utils\error-handler.js:98
  var doExit = npm.config.loaded ? npm.config.get('_exit') : true
                          ^
TypeError: Cannot read property 'loaded' of undefined
    at exit (C:\Program Files\nodejs\node_modules\npm\lib\utils\error-handler.js:98:27)
    at process.errorHandler (C:\Program Files\nodejs\node_modules\npm\lib\utils\error-handler.js:216:3)
    at process.emit (events.js:198:13)
    at process._fatalException (internal/bootstrap/node.js:496:27)
Install for electron-builder@latest failed with code 7
F:\cloud_drive\Dropbox\articles\elec_net\kestrel_razor_sample\ConsoleApp1\obj\desktop\win-x64>
... done

npm ERR! code ENOLOCAL
npm ERR! Could not install from "User\AppData\Roaming\npm-cache\_npx\16672" as it does not contain a package.json file.
npm ERR! A complete log of this run can be found in:
npm ERR!     C:\Users\Default User\AppData\Roaming\npm-cache\_logs\2021-01-27T05_21_25_321Z-debug.log
Install for electron-builder@latest failed with code 1

출력에 나온 log 파일을 보면 node.exe에 전달된 경로가 이렇게 해석된 것을 확인할 수 있습니다.

0 info it worked if it ends with ok
1 verbose cli [ 'C:\\Program Files\\nodejs\\node.exe',
1 verbose cli   'C:\\Program Files\\nodejs\\node_modules\\npm\\bin\\npm-cli.js',
1 verbose cli   'install',
1 verbose cli   'electron-builder@latest',
1 verbose cli   '--global',
1 verbose cli   '--prefix',
1 verbose cli   'C:\\Users\\Default',
1 verbose cli   'User\\AppData\\Roaming\\npm-cache\\_npx\\16672',
1 verbose cli   '--loglevel',
1 verbose cli   'error',
1 verbose cli   '--json' ]
...[생략]...

원인을 유추해 보면, 저 경로는 "%APPDATA%" 경로에 포함된 공백이 명령행 인자에서 2개로 나눠져 인식이 되었기 때문입니다.




이에 대한 근본적인 원인을 해결하려면 저렇게 실행하는 코드를 수정해야 합니다. 가령 node.exe를 실행할 때 전달하는 %APPDATA%에 대한 경로를 다음과 같은 식으로 인용 부호로 묶어 전달해야 합니다.

c:\temp> node.exe "C:\Users\Default User\AppData\Roaming\npm-cache\_npx\16672" ...[생략]...

따라서 이러한 버그를 수정해 달라는 이슈를 생성하거나, 아니면 직접 소스 코드를 고쳐 빌드하는 수 밖에는 없습니다.




한 가지 다행이라면, 이렇게 경로에 '공백 문자'가 있는 경우 8.3 형식의 경로를 사용해 표현하는 것이 가능하다는 점입니다.

Windows - 도스 시절의 8.3 경로를 알아내는 방법
; https://www.sysnet.pe.kr/2/0/12511

가령, 이런 경우 electronize는 내부에서 "C:\Users\Default User\AppData\Roaming\npm-cache\_npx\21340"라는 경로를 아마도 다음과 같은 식으로 구했을 것입니다.

string path = GetEnvrionmentVairable("APPDATA"); // C:\Users\Default User\AppData\Roaming
string arg1 = path + "\npm-cache\_npx\16672";

따라서 환경 변수로 설정된 LOCALAPPDATA나, APPDATA에 대해 같은 경로로 대우받는 8.3 형식으로 명시하면 됩니다.

SET LOCALAPPDATA=C:\Users\DEFAULT~1\AppData\Local
SET APPDATA=C:\Users\DEFAULT~1\AppData\Roaming

이때 사용자 계정으로 등록된 "Default User"의 8.3 이름은 다음과 같은 명령어로 간단하게 구할 수 있습니다.

C:\temp> dir /X "%USERPROFILE%\.."
 Volume in drive C has no label.
 Volume Serial Number is C02C-196F

 Directory of C:\Users

2021-01-27  오후 02:33    <DIR>                       .
2021-01-27  오후 02:33    <DIR>                       ..
2020-12-24  오후 08:17    <DIR>          DEFAUL~1     Default User
2021-01-22  오후 07:42    <DIR>          MSSQLS~1     MSSQLSERVER
2020-12-03  오전 11:02    <DIR>          RDVGRA~1     RDV GRAPHICS SERVICE
2021-01-22  오후 07:42    <DIR>          SQLTEL~1     SQLTELEMETRY
               0 File(s)              0 bytes
               6 Dir(s)  50,487,128,064 bytes free

명령행에서 이렇게 설정하고 다시 문제가 되었던 빌드 명령을 수행하면,

c:\temp> SET LOCALAPPDATA=C:\Users\DEFAULT~1\AppData\Local
c:\temp> SET APPDATA=C:\Users\DEFAULT~1\AppData\Roaming

c:\temp> electronize build /target win-x64 /PublishReadyToRun false

정상적으로 실행이 되는 것을 확인할 수 있습니다.




[이 글에 대해서 여러분들과 의견을 공유하고 싶습니다. 틀리거나 미흡한 부분 또는 의문 사항이 있으시면 언제든 댓글 남겨주십시오.]



donaricano-btn



[최초 등록일: ]
[최종 수정일: 8/18/2021]

Creative Commons License
이 저작물은 크리에이티브 커먼즈 코리아 저작자표시-비영리-변경금지 2.0 대한민국 라이센스에 따라 이용하실 수 있습니다.
by SeongTae Jeong, mailto:techsharer at outlook.com

비밀번호

댓글 쓴 사람
 




1  2  3  4  5  6  7  8  9  10  11  12  13  [14]  15  ...
NoWriterDateCnt.TitleFile(s)
12525정성태2/1/2021729개발 환경 구성: 531. Azure Devops - 파이프라인 실행 시 빌드 이벤트를 생략하는 방법
12524정성태1/31/2021863개발 환경 구성: 530. 기존 github 프로젝트를 Azure Devops의 빌드 Pipeline에 연결하는 방법 [1]
12523정성태1/31/2021849개발 환경 구성: 529. 기존 github 프로젝트를 Azure Devops의 Board에 연결하는 방법
12522정성태1/31/20211136개발 환경 구성: 528. 오라클 클라우드의 리눅스 VM - 9000 MTU Jumbo Frame 테스트
12521정성태1/31/20211224개발 환경 구성: 527. 이더넷(Ethernet) 환경의 TCP 통신에서 MSS(Maximum Segment Size) 확인
12520정성태1/30/2021742개발 환경 구성: 526. 오라클 클라우드의 VM에 ping ICMP 여는 방법
12519정성태1/30/2021912개발 환경 구성: 525. 오라클 클라우드의 VM을 외부에서 접근하기 위해 포트 여는 방법
12518정성태1/30/20212060Linux: 37. Ubuntu에 Wireshark 설치
12517정성태1/30/20211536Linux: 36. 윈도우 클라이언트에서 X2Go를 이용한 원격 리눅스의 GUI 접속 - 우분투 20.04
12516정성태1/29/20211014Windows: 188. Windows - TCP default template 설정 방법
12515정성태1/28/20211087웹: 41. Microsoft Edge - localhost에 대해 http 접근 시 무조건 https로 바뀌는 문제 [3]
12514정성태1/28/20211636.NET Framework: 1021. C# - 일렉트론 닷넷(Electron.NET) 소개 [1]파일 다운로드1
12513정성태1/28/2021826오류 유형: 698. electronize - User Profile 디렉터리에 공백 문자가 있는 경우 빌드가 실패하는 문제
12512정성태1/28/2021866오류 유형: 697. The program can't start because VCRUNTIME140.dll is missing from your computer. Try reinstalling the program to fix this problem.
12511정성태1/27/2021902Windows: 187. Windows - 도스 시절의 8.3 경로를 알아내는 방법
12510정성태1/27/20211048.NET Framework: 1020. .NET Core Kestrel 호스팅 - Razor 지원 추가 [1]파일 다운로드1
12509정성태1/27/20211002개발 환경 구성: 524. Jupyter Notebok에서 C#(F#, PowerShell) 언어 사용을 위한 환경 구성
12508정성태1/27/2021877개발 환경 구성: 523. Jupyter Notebook - Slide 플레이 버튼이 없는 경우
12507정성태1/26/2021799VS.NET IDE: 157. Visual Studio - Syntax Visualizer 메뉴가 없는 경우
12506정성태1/25/2021824.NET Framework: 1019. Microsoft.Tye 기본 사용법 소개
12505정성태1/23/20211032.NET Framework: 1018. .NET Core Kestrel 호스팅 - Web API 추가 [1]파일 다운로드1
12504정성태1/23/20211428.NET Framework: 1017. .NET 5에서의 네트워크 라이브러리 개선 (2) - HTTP/2, HTTP/3 관련 [2]
12503정성태1/21/20211153오류 유형: 696. C# - HttpClient: Requesting HTTP version 2.0 with version policy RequestVersionExact while HTTP/2 is not enabled.
12502정성태1/21/20211122.NET Framework: 1016. .NET Core HttpClient의 HTTP/2 지원파일 다운로드1
12501정성태1/21/20211001.NET Framework: 1015. .NET 5부터 HTTP/1.1, 2.0 선택을 위한 HttpVersionPolicy 동작 방식파일 다운로드1
12500정성태1/21/20211006.NET Framework: 1014. ASP.NET Core(Kestrel)의 HTTP/2 지원 여부파일 다운로드1
1  2  3  4  5  6  7  8  9  10  11  12  13  [14]  15  ...