Microsoft MVP성태의 닷넷 이야기
글쓴 사람
정성태 (techsharer at outlook.com)
홈페이지
첨부 파일
 

NETSDK1045 The current .NET SDK does not support targeting .NET ...

msbuild로 솔루션 파일을 빌드했을 때 다음과 같은 오류가 발생합니다.

D:\temp> msbuild D:\temp\testapp\testapp.sln
Microsoft (R) Build Engine version 17.1.0+ae57d105c for .NET Framework
Copyright (C) Microsoft Corporation. All rights reserved.

Building the projects in this solution one at a time. To enable parallel build, please add the "-m" switch.
Build started 2023-01-19 오후 2:51:20.
Project "D:\temp\testapp\testapp.sln" on node 1 (default targets).
ValidateSolutionConfiguration:
  Building solution configuration "Debug|Any CPU".
Project "D:\temp\testapp\testapp.sln" (1) is building "D:\temp\testapp\testapp\testapp.csproj" (2) on node 1 (default targets).
C:\Program Files\dotnet\sdk\6.0.200\Sdks\Microsoft.NET.Sdk\targets\Microsoft.NET.TargetFrameworkInference.targets(144,5): error NETSDK1045: The current .NET SDK does not support targeting .NET 7.0.  Either target .NET 6.0 or lower, or use a version of the .NET SDK that supports .NET 7.0. [D:\temp\testapp\testapp\testapp.csproj]
Done Building Project "D:\temp\testapp\testapp\testapp.csproj" (default targets) -- FAILED.

Done Building Project "D:\temp\testapp\testapp.sln" (default targets) -- FAILED.

Build FAILED.

자세히 보시면, msbuild가 선택한 닷넷 SDK 버전이 "C:\Program Files\dotnet\sdk\6.0.200"라고 나옵니다. 즉, 7.0 SDK가 설치되었는데도,

c:\temp> dotnet --list-sdks
6.0.200 [C:\Program Files\dotnet\sdk]
7.0.102 [C:\Program Files\dotnet\sdk]

c:\temp> where msbuild
C:\Program Files\Microsoft Visual Studio\2022\Enterprise\MSBuild\Current\Bin\amd64\MSBuild.exe

Visual Studio에 포함된 msbuild.exe는 6.0.200을 인식하고 있는 것입니다. 사실, 이에 대한 원인은, .NET 7 SDK를 설치하는 순간에 이미 알려주고 있습니다.

msbuild_with_net7_1.png

보는 바와 같이 2022 17.4 버전 이상이 필요하다고 하는데, 저것보다 낮으면,

msbuild_with_net7_2.png

NETSDK1045 오류가 발생하는 것입니다. 이에 대한 문제를 해결하려면 당연히 Visual Studio 2022를 최신 업데이트로 올리면 됩니다. 혹은, 그걸 원하지 않는다면 그냥 "dotnet.exe"를 이용해 곧바로 빌드해도 무방합니다.

c:\temp> dotnet build D:\temp\testapp\testapp.sln
MSBuild version 17.4.1+9a89d02ff for .NET
  Determining projects to restore...
  All projects are up-to-date for restore.
  testapp -> D:\temp\testapp\testapp\bin\Debug\net7.0-windows\testapp.dll

Build succeeded.
    0 Warning(s)
    0 Error(s)

참고로, 위의 msbuild 메시지에도 나오지만 버전 정보가 "17.4.1"이고, "NETSDK1045" 오류가 발생했을 때는 그 버전이 "17.1.0"이었습니다.

마지막으로, 해당 오류는 preview 버전을 사용할 때도 나올 수 있습니다.

Visual Studio 2022 17.2 버전에서 C# 11 또는 .NET 7.0 preview 적용
; https://www.sysnet.pe.kr/2/0/13080




[이 글에 대해서 여러분들과 의견을 공유하고 싶습니다. 틀리거나 미흡한 부분 또는 의문 사항이 있으시면 언제든 댓글 남겨주십시오.]







[최초 등록일: ]
[최종 수정일: 1/19/2023]

Creative Commons License
이 저작물은 크리에이티브 커먼즈 코리아 저작자표시-비영리-변경금지 2.0 대한민국 라이센스에 따라 이용하실 수 있습니다.
by SeongTae Jeong, mailto:techsharer at outlook.com

비밀번호

댓글 작성자
 




1  2  3  4  5  6  7  8  9  [10]  11  12  13  14  15  ...
NoWriterDateCnt.TitleFile(s)
13342정성태5/8/20233514.NET Framework: 2115. System.Text.Json의 역직렬화 시 필드/속성 주의
13341정성태5/8/20233336닷넷: 2114. C# 12 - 모든 형식의 별칭(Using aliases for any type)
13340정성태5/8/20233227오류 유형: 857. Microsoft.Data.SqlClient.SqlException - 0x80131904
13339정성태5/6/20233909닷넷: 2113. C# 12 - 기본 생성자(Primary Constructors)
13338정성태5/6/20233486닷넷: 2112. C# 12 - 기본 람다 매개 변수파일 다운로드1
13337정성태5/5/20233883Linux: 59. dockerfile - docker exec로 container에 접속 시 자동으로 실행되는 코드 적용
13336정성태5/4/20233631.NET Framework: 2111. C# - 바이너리 출력 디렉터리와 연관된 csproj 설정
13335정성태4/30/20233761.NET Framework: 2110. C# - FFmpeg.AutoGen 라이브러리를 이용한 기본 프로젝트 구성 - Windows Forms파일 다운로드1
13334정성태4/29/20233520Windows: 250. Win32 C/C++ - Modal 메시지 루프 내에서 SetWindowsHookEx를 이용한 Thread 메시지 처리 방법
13333정성태4/28/20232979Windows: 249. Win32 C/C++ - 대화창 템플릿을 런타임에 코딩해서 사용파일 다운로드1
13332정성태4/27/20233112Windows: 248. Win32 C/C++ - 대화창을 위한 메시지 루프 사용자 정의파일 다운로드1
13331정성태4/27/20233120오류 유형: 856. dockerfile - 구 버전의 .NET Core 이미지 사용 시 apt update 오류
13330정성태4/26/20232782Windows: 247. Win32 C/C++ - CS_GLOBALCLASS 설명
13329정성태4/24/20233078Windows: 246. Win32 C/C++ - 직접 띄운 대화창 템플릿을 위한 Modal 메시지 루프 생성파일 다운로드1
13328정성태4/19/20232691VS.NET IDE: 184. Visual Studio - Fine Code Coverage에서 동작하지 않는 Fake/Shim 테스트
13327정성태4/19/20233116VS.NET IDE: 183. C# - .NET Core/5+ 환경에서 Fakes를 이용한 단위 테스트 방법
13326정성태4/18/20234307.NET Framework: 2109. C# - 닷넷 응용 프로그램에서 SQLite 사용 (System.Data.SQLite) [1]파일 다운로드1
13325정성태4/18/20233756스크립트: 48. 파이썬 - PostgreSQL의 with 문을 사용한 경우 연결 개체 누수
13324정성태4/17/20233566.NET Framework: 2108. C# - Octave의 "save -binary ..."로 생성한 바이너리 파일 분석파일 다운로드1
13323정성태4/16/20233429개발 환경 구성: 677. Octave에서 Excel read/write를 위한 io 패키지 설치
13322정성태4/15/20234084VS.NET IDE: 182. Visual Studio - 32비트로만 빌드된 ActiveX와 작업해야 한다면?
13321정성태4/14/20233102개발 환경 구성: 676. WSL/Linux Octave - Python 스크립트 연동
13320정성태4/13/20233111개발 환경 구성: 675. Windows Octave 8.1.0 - Python 스크립트 연동
13319정성태4/12/20233493개발 환경 구성: 674. WSL 2 환경에서 GNU Octave 설치
13318정성태4/11/20233317개발 환경 구성: 673. JetBrains IDE에서 "Squash Commits..." 메뉴가 비활성화된 경우
13317정성태4/11/20233472오류 유형: 855. WSL 2 Ubuntu 20.04 - error: cannot communicate with server: Post http://localhost/v2/snaps/...
1  2  3  4  5  6  7  8  9  [10]  11  12  13  14  15  ...