Microsoft MVP성태의 닷넷 이야기
글쓴 사람
정성태 (techsharer at outlook.com)
홈페이지
첨부 파일
 

.NET Core 2.2 빌드 - error MSB4018: The "RazorTagHelper" task failed unexpectedly.

이상하군요, .NET Core 2.0/2.1 프로젝트는 괜찮은데 유독 2.2 프로젝트에서만 빌드 오류가 발생합니다.

Rebuild started...
1>------ Rebuild All started: Project: CoreCoreWin2, Configuration: Debug Any CPU ------
1>C:\Program Files\dotnet\sdk\5.0.100\Sdks\Microsoft.NET.Sdk\targets\Microsoft.NET.EolTargetFrameworks.targets(28,5): warning NETSDK1138: The target framework 'netcoreapp2.2' is out of support and will not receive security updates in the future. Please refer to https://aka.ms/dotnet-core-support for more information about the support policy.
1>D:\workshop2\JenniferV\gitlab\UnitTest\AzureWebApps\AzureWebTest\CoreCoreWin2\Pages\Index.cshtml.cs(142,36,142,49): warning CS1998: This async method lacks 'await' operators and will run synchronously. Consider using the 'await' operator to await non-blocking API calls, or 'await Task.Run(...)' to do CPU-bound work on a background thread.
1>F:\nuget_root\microsoft.aspnetcore.razor.design\2.2.0\build\netstandard2.0\Microsoft.AspNetCore.Razor.Design.CodeGeneration.targets(79,5): error MSB4018: The "RazorTagHelper" task failed unexpectedly.
1>F:\nuget_root\microsoft.aspnetcore.razor.design\2.2.0\build\netstandard2.0\Microsoft.AspNetCore.Razor.Design.CodeGeneration.targets(79,5): error MSB4018: System.InvalidOperationException: DOTNET_HOST_PATH is not set
1>F:\nuget_root\microsoft.aspnetcore.razor.design\2.2.0\build\netstandard2.0\Microsoft.AspNetCore.Razor.Design.CodeGeneration.targets(79,5): error MSB4018:    at Microsoft.AspNetCore.Razor.Tasks.DotNetToolTask.get_DotNetPath()
1>F:\nuget_root\microsoft.aspnetcore.razor.design\2.2.0\build\netstandard2.0\Microsoft.AspNetCore.Razor.Design.CodeGeneration.targets(79,5): error MSB4018:    at Microsoft.AspNetCore.Razor.Tasks.DotNetToolTask.GenerateFullPathToTool()
1>F:\nuget_root\microsoft.aspnetcore.razor.design\2.2.0\build\netstandard2.0\Microsoft.AspNetCore.Razor.Design.CodeGeneration.targets(79,5): error MSB4018:    at Microsoft.Build.Utilities.ToolTask.ComputePathToTool()
1>F:\nuget_root\microsoft.aspnetcore.razor.design\2.2.0\build\netstandard2.0\Microsoft.AspNetCore.Razor.Design.CodeGeneration.targets(79,5): error MSB4018:    at Microsoft.Build.Utilities.ToolTask.Execute()
1>F:\nuget_root\microsoft.aspnetcore.razor.design\2.2.0\build\netstandard2.0\Microsoft.AspNetCore.Razor.Design.CodeGeneration.targets(79,5): error MSB4018:    at Microsoft.AspNetCore.Razor.Tasks.DotNetToolTask.Execute()
1>F:\nuget_root\microsoft.aspnetcore.razor.design\2.2.0\build\netstandard2.0\Microsoft.AspNetCore.Razor.Design.CodeGeneration.targets(79,5): error MSB4018:    at Microsoft.Build.BackEnd.TaskExecutionHost.Microsoft.Build.BackEnd.ITaskExecutionHost.Execute()
1>F:\nuget_root\microsoft.aspnetcore.razor.design\2.2.0\build\netstandard2.0\Microsoft.AspNetCore.Razor.Design.CodeGeneration.targets(79,5): error MSB4018:    at Microsoft.Build.BackEnd.TaskBuilder.<ExecuteInstantiatedTask>d__26.MoveNext()
1>Done building project "CoreCoreWin2.csproj" -- FAILED.
========== Rebuild All: 0 succeeded, 1 failed, 0 skipped ==========

DOTNET_HOST_PATH가 설정되어 있지 않다고 하는데, 실제로 검색해 보면,

Build is failing for Microsoft.NET.Sdk.Razor project
; https://developercommunity2.visualstudio.com/t/Build-is-failing-for-MicrosoftNETSdkR/1251808?preview=true

해결책으로 환경 변수 설정이 필요하다고 합니다.

환경 변수 이름: DOTNET_HOST_PATH
환경 변숫값: dotnet

path라는 이름에서 dotnet.exe가 있는 경로를 지정해야 할 것 같지만,

%ProgramFiles%\dotnet\dotnet.exe

환경 변수 PATH에 경로가 잡혀 있는 경우 dotnet만 있어도 잘 동작합니다.




[이 글에 대해서 여러분들과 의견을 공유하고 싶습니다. 틀리거나 미흡한 부분 또는 의문 사항이 있으시면 언제든 댓글 남겨주십시오.]



donaricano-btn



[최초 등록일: ]
[최종 수정일: 12/1/2020

Creative Commons License
이 저작물은 크리에이티브 커먼즈 코리아 저작자표시-비영리-변경금지 2.0 대한민국 라이센스에 따라 이용하실 수 있습니다.
by SeongTae Jeong, mailto:techsharer at outlook.com

비밀번호

댓글 쓴 사람
 




[1]  2  3  4  5  6  7  8  9  10  11  12  13  14  15  ...
NoWriterDateCnt.TitleFile(s)
12752정성태8/4/202143개발 환경 구성: 592. JetBrains의 IDE(예를 들어, PyCharm)에서 Visual Studio 키보드 매핑 적용
12751정성태8/4/202155개발 환경 구성: 591. Windows 10 WSL2 환경에서 docker-compose 빌드하는 방법
12750정성태8/3/202182디버깅 기술: 181. windbg - 콜 스택의 "Call Site" 오프셋 값이 가리키는 위치
12749정성태8/2/202173개발 환경 구성: 590. Visual Studio 2017부터 단위 테스트에 DataRow 특성 지원
12748정성태8/2/202131개발 환경 구성: 589. Azure Active Directory - tenant의 관리자(admin) 계정 로그인 방법
12747정성태8/1/202146오류 유형: 748. 오류 기록 - MICROSOFT GRAPH – HOW TO IMPLEMENT IAUTHENTICATIONPROVIDER파일 다운로드1
12746정성태7/31/202199개발 환경 구성: 588. 네트워크 장비 환경을 시뮬레이션하는 Packet Tracer 프로그램 소개
12745정성태7/31/202128개발 환경 구성: 587. Azure Active Directory - tenant의 관리자 계정 로그인 방법
12744정성태7/30/202133개발 환경 구성: 586. Azure Active Directory에 연결된 App 목록을 확인하는 방법?
12743정성태7/30/202153.NET Framework: 1083. Azure Active Directory - 외부 Token Cache 저장소를 사용하는 방법파일 다운로드1
12742정성태7/30/202137개발 환경 구성: 585. Azure AD 인증을 위한 사용자 인증 유형
12741정성태7/29/202186.NET Framework: 1082. Azure Active Directory - Microsoft Graph API 호출 방법파일 다운로드1
12740정성태7/29/202156오류 유형: 747. SharePoint - InvalidOperationException 0x80131509
12739정성태7/28/202165오류 유형: 746. Azure Active Directory - IDW10106: The 'ClientId' option must be provided.
12738정성태7/28/202167오류 유형: 745. Azure Active Directory - Client credential flows must have a scope value with /.default suffixed to the resource identifier (application ID URI).
12737정성태7/28/202169오류 유형: 744. Azure Active Directory - The resource principal named api://...[client_id]... was not found in the tenant
12736정성태7/28/202150오류 유형: 743. Active Azure Directory에서 "API permissions"의 권한 설정이 "Not granted for ..."로 나오는 문제
12735정성태7/27/202186.NET Framework: 1081. C# - Azure AD 인증을 지원하는 데스크톱 애플리케이션 예제(Windows Forms)파일 다운로드1
12734정성태7/26/2021100스크립트: 20. 특정 단어로 시작하거나/끝나는 문자열을 포함/제외하는 정규 표현식 - Look-around
12733정성태7/23/2021124.NET Framework: 1081. Self-Contained/SingleFile 유형의 .NET Core/5+ 실행 파일을 임베딩한다면?파일 다운로드2
12732정성태7/23/202165오류 유형: 742. SharePoint - The super user account utilized by the cache is not configured.
12731정성태7/23/202184개발 환경 구성: 584. Add Internal URLs 화면에서 "Save" 버튼이 비활성화 된 경우
12730정성태7/23/202198개발 환경 구성: 583. Visual Studio Code - Go 코드에서 입력을 받는 경우
12729정성태7/22/202196.NET Framework: 1080. xUnit 단위 테스트에 메서드/클래스 수준의 문맥 제공 - Fixture
12728정성태7/22/202179.NET Framework: 1079. MSTestv2 단위 테스트에 메서드/클래스/어셈블리 수준의 문맥 제공
[1]  2  3  4  5  6  7  8  9  10  11  12  13  14  15  ...